{"text_format":"1","workbook":"xlsx","n_sheets":5,"sheets":["Instructions","Data","Chart","Lookup","Calcs"],"not_rendered":{"charts":1,"images":2,"macros":1,"external_links":0,"defined_names":9,"comments":0,"pivot_tables":0},"unopened":[],"bounds":{"document_bytes":16777216,"sheet_cells":100000,"rows_first":2000,"rows_last":500,"rows_between":2000,"halvings":0,"cell_chars":16384,"cell_head_chars":4096},"cells_cut":0,"cells_raw":0,"read":"whole","date_system":"1900"}

{"sheet":"Instructions","index":0,"n_rows":10,"n_cols":2,"rows_kept":10,"cut":false,"hidden":false,"merged":[[0,0,0,5],[8,1,8,8],[11,0,11,8],[2,0,2,8],[4,1,4,8],[5,1,5,8],[6,1,6,8],[7,1,7,8]]}
["Instructions"]
[]
["This template produces a funnel plot to help you highlight variation in your data. Each coloured dot is a data point. The central line is the overall mean. The dotted lines show two standard deviations from the mean. Points inside the dotted lines are within the limits of normal variation and are shaded blue. Points below the lower limit are shaded orange and points above the upper limit are shaded green. To produce a chart:"]
[]
[1,"Go to the Data sheet."]
[2,"Clear any existing data using the 'Clear Data' button."]
[3,"Copy and paste your data into cell A6 of the data sheet. The template is set up for two columns of data."]
[4,"Add your chart title and axis labels at the top of the sheet."]
[5,"Click the chart button. This will sort your data and produce your chart."]
[6,"To review your data or produce a new chart, click the Data button."]

{"sheet":"Data","index":1,"n_rows":5,"n_cols":3,"rows_kept":5,"cut":false,"hidden":false,"merged":[]}
["Chart title","Time to triage"]
["X axis","Number of patients"]
["Y axis","Mean time to triage"]
[]
["Staff name","N","Val"]

{"sheet":"Chart","index":2,"n_rows":2,"n_cols":15,"rows_kept":2,"cut":false,"hidden":false,"merged":[]}
[null,null,null,null,null,null,null,null,null,null,null,null,null,null,"Show outlier names?"]
[null,null,null,null,null,null,null,null,null,null,null,null,null,null,"No"]

{"sheet":"Lookup","index":3,"n_rows":2,"n_cols":1,"rows_kept":2,"cut":false,"hidden":true,"merged":[]}
["Yes"]
["No"]

{"sheet":"Calcs","index":4,"n_rows":205,"n_cols":11,"rows_kept":205,"cut":false,"hidden":true,"merged":[]}
["Range","N patients","Val","Avg","Lower","Upper","Orange","Blue","Green","STDEV","Label"]
[{"$f":"IF(B2=\"\",\"\",1)","v":""},{"$f":"IF(Data!B6=\"\",\"\",Data!B6)","v":""},{"$f":"IF(Data!C6=\"\",\"\",Data!C6)","v":""},{"$f":"IF(B2=\"\",\"\",AVERAGE(Data!C:C))","v":""},{"$f":"IF(B2=\"\",\"\",IF((AVERAGE(Data!C:C)-2*J2)<0,0,AVERAGE(Data!C:C)-2*J2))","v":""},{"$f":"IF(B2=\"\",\"\",AVERAGE(Data!C:C)+2*J2)","v":""},{"$f":"IF(B2=\"\",\"\",IF(Data!C6<E2,Data!C6,#N/A))","v":""},{"$f":"IF(B2=\"\",\"\",IF(AND(Data!C6>=E2,Data!C6<=F2)=TRUE,Data!C6,\"\"))","v":""},{"$f":"IF(B2=\"\",\"\",IF(Data!C6>F2,Data!C6,#N/A))","v":""},{"$f":"STDEV(Data!C:C)/SQRT(Data!B6)","v":{"$error":"#DIV/0!"}},{"$f":"IF(AND(Data!A6<>\"\",Chart!$O$2=\"Yes\"),Data!A6,\"\")","v":""}]
[{"$f":"IF(B3=\"\",\"\",1)","v":""},{"$f":"IF(Data!B7=\"\",\"\",Data!B7)","v":""},{"$f":"IF(Data!C7=\"\",\"\",Data!C7)","v":""},{"$f":"IF(B3=\"\",\"\",AVERAGE(Data!C:C))","v":""},{"$f":"IF(B3=\"\",\"\",IF((AVERAGE(Data!C:C)-2*J3)<0,0,AVERAGE(Data!C:C)-2*J3))","v":""},{"$f":"IF(B3=\"\",\"\",AVERAGE(Data!C:C)+2*J3)","v":""},{"$f":"IF(B3=\"\",\"\",IF(Data!C7<E3,Data!C7,#N/A))","v":""},{"$f":"IF(AND(Data!C7>=E3,Data!C7<=F3)=TRUE,Data!C7,#N/A)","v":0},{"$f":"IF(B3=\"\",\"\",IF(Data!C7>F3,Data!C7,#N/A))","v":""},{"$f":"STDEV(Data!C:C)/SQRT(Data!B7)","v":{"$error":"#DIV/0!"}},{"$f":"IF(AND(Data!A7<>\"\",Chart!$O$2=\"Yes\"),Data!A7,\"\")","v":""}]
["",{"$f":"IF(Data!B8=\"\",\"\",Data!B8)","v":""},{"$f":"IF(Data!C8=\"\",\"\",Data!C8)","v":""},{"$f":"IF(B4=\"\",\"\",AVERAGE(Data!C:C))","v":""},{"$f":"IF(B4=\"\",\"\",IF((AVERAGE(Data!C:C)-2*J4)<0,0,AVERAGE(Data!C:C)-2*J4))","v":""},{"$f":"IF(B4=\"\",\"\",AVERAGE(Data!C:C)+2*J4)","v":""},{"$f":"IF(B4=\"\",\"\",IF(Data!C8<E4,Data!C8,#N/A))","v":""},{"$f":"IF(AND(Data!C8>=E4,Data!C8<=F4)=TRUE,Data!C8,#N/A)","v":0},{"$f":"IF(B4=\"\",\"\",IF(Data!C8>F4,Data!C8,#N/A))","v":""},{"$f":"STDEV(Data!C:C)/SQRT(Data!B8)","v":{"$error":"#DIV/0!"}},{"$f":"IF(AND(Data!A8<>\"\",Chart!$O$2=\"Yes\"),Data!A8,\"\")","v":""}]
["",{"$f":"IF(Data!B9=\"\",\"\",Data!B9)","v":""},{"$f":"IF(Data!C9=\"\",\"\",Data!C9)","v":""},{"$f":"IF(B5=\"\",\"\",AVERAGE(Data!C:C))","v":""},{"$f":"IF(B5=\"\",\"\",IF((AVERAGE(Data!C:C)-2*J5)<0,0,AVERAGE(Data!C:C)-2*J5))","v":""},{"$f":"IF(B5=\"\",\"\",AVERAGE(Data!C:C)+2*J5)","v":""},{"$f":"IF(B5=\"\",\"\",IF(Data!C9<E5,Data!C9,#N/A))","v":""},{"$f":"IF(AND(Data!C9>=E5,Data!C9<=F5)=TRUE,Data!C9,#N/A)","v":0},{"$f":"IF(B5=\"\",\"\",IF(Data!C9>F5,Data!C9,#N/A))","v":""},{"$f":"STDEV(Data!C:C)/SQRT(Data!B9)","v":{"$error":"#DIV/0!"}},{"$f":"IF(AND(Data!A9<>\"\",Chart!$O$2=\"Yes\"),Data!A9,\"\")","v":""}]
["",{"$f":"IF(Data!B10=\"\",\"\",Data!B10)","v":""},{"$f":"IF(Data!C10=\"\",\"\",Data!C10)","v":""},{"$f":"IF(B6=\"\",\"\",AVERAGE(Data!C:C))","v":""},{"$f":"IF(B6=\"\",\"\",IF((AVERAGE(Data!C:C)-2*J6)<0,0,AVERAGE(Data!C:C)-2*J6))","v":""},{"$f":"IF(B6=\"\",\"\",AVERAGE(Data!C:C)+2*J6)","v":""},{"$f":"IF(B6=\"\",\"\",IF(Data!C10<E6,Data!C10,#N/A))","v":""},{"$f":"IF(AND(Data!C10>=E6,Data!C10<=F6)=TRUE,Data!C10,#N/A)","v":0},{"$f":"IF(B6=\"\",\"\",IF(Data!C10>F6,Data!C10,#N/A))","v":""},{"$f":"STDEV(Data!C:C)/SQRT(Data!B10)","v":{"$error":"#DIV/0!"}},{"$f":"IF(AND(Data!A10<>\"\",Chart!$O$2=\"Yes\"),Data!A10,\"\")","v":""}]
["",{"$f":"IF(Data!B11=\"\",\"\",Data!B11)","v":""},{"$f":"IF(Data!C11=\"\",\"\",Data!C11)","v":""},{"$f":"IF(B7=\"\",\"\",AVERAGE(Data!C:C))","v":""},{"$f":"IF(B7=\"\",\"\",IF((AVERAGE(Data!C:C)-2*J7)<0,0,AVERAGE(Data!C:C)-2*J7))","v":""},{"$f":"IF(B7=\"\",\"\",AVERAGE(Data!C:C)+2*J7)","v":""},{"$f":"IF(B7=\"\",\"\",IF(Data!C11<E7,Data!C11,#N/A))","v":""},{"$f":"IF(AND(Data!C11>=E7,Data!C11<=F7)=TRUE,Data!C11,#N/A)","v":0},{"$f":"IF(B7=\"\",\"\",IF(Data!C11>F7,Data!C11,#N/A))","v":""},{"$f":"STDEV(Data!C:C)/SQRT(Data!B11)","v":{"$error":"#DIV/0!"}},{"$f":"IF(AND(Data!A11<>\"\",Chart!$O$2=\"Yes\"),Data!A11,\"\")","v":""}]
["",{"$f":"IF(Data!B12=\"\",\"\",Data!B12)","v":""},{"$f":"IF(Data!C12=\"\",\"\",Data!C12)","v":""},{"$f":"IF(B8=\"\",\"\",AVERAGE(Data!C:C))","v":""},{"$f":"IF(B8=\"\",\"\",IF((AVERAGE(Data!C:C)-2*J8)<0,0,AVERAGE(Data!C:C)-2*J8))","v":""},{"$f":"IF(B8=\"\",\"\",AVERAGE(Data!C:C)+2*J8)","v":""},{"$f":"IF(B8=\"\",\"\",IF(Data!C12<E8,Data!C12,#N/A))","v":""},{"$f":"IF(AND(Data!C12>=E8,Data!C12<=F8)=TRUE,Data!C12,#N/A)","v":0},{"$f":"IF(B8=\"\",\"\",IF(Data!C12>F8,Data!C12,#N/A))","v":""},{"$f":"STDEV(Data!C:C)/SQRT(Data!B12)","v":{"$error":"#DIV/0!"}},{"$f":"IF(AND(Data!A12<>\"\",Chart!$O$2=\"Yes\"),Data!A12,\"\")","v":""}]
["",{"$f":"IF(Data!B13=\"\",\"\",Data!B13)","v":""},{"$f":"IF(Data!C13=\"\",\"\",Data!C13)","v":""},{"$f":"IF(B9=\"\",\"\",AVERAGE(Data!C:C))","v":""},{"$f":"IF(B9=\"\",\"\",IF((AVERAGE(Data!C:C)-2*J9)<0,0,AVERAGE(Data!C:C)-2*J9))","v":""},{"$f":"IF(B9=\"\",\"\",AVERAGE(Data!C:C)+2*J9)","v":""},{"$f":"IF(B9=\"\",\"\",IF(Data!C13<E9,Data!C13,#N/A))","v":""},{"$f":"IF(AND(Data!C13>=E9,Data!C13<=F9)=TRUE,Data!C13,#N/A)","v":0},{"$f":"IF(B9=\"\",\"\",IF(Data!C13>F9,Data!C13,#N/A))","v":""},{"$f":"STDEV(Data!C:C)/SQRT(Data!B13)","v":{"$error":"#DIV/0!"}},{"$f":"IF(AND(Data!A13<>\"\",Chart!$O$2=\"Yes\"),Data!A13,\"\")","v":""}]
["",{"$f":"IF(Data!B14=\"\",\"\",Data!B14)","v":""},{"$f":"IF(Data!C14=\"\",\"\",Data!C14)","v":""},{"$f":"IF(B10=\"\",\"\",AVERAGE(Data!C:C))","v":""},{"$f":"IF(B10=\"\",\"\",IF((AVERAGE(Data!C:C)-2*J10)<0,0,AVERAGE(Data!C:C)-2*J10))","v":""},{"$f":"IF(B10=\"\",\"\",AVERAGE(Data!C:C)+2*J10)","v":""},{"$f":"IF(B10=\"\",\"\",IF(Data!C14<E10,Data!C14,#N/A))","v":""},{"$f":"IF(AND(Data!C14>=E10,Data!C14<=F10)=TRUE,Data!C14,#N/A)","v":0},{"$f":"IF(B10=\"\",\"\",IF(Data!C14>F10,Data!C14,#N/A))","v":""},{"$f":"STDEV(Data!C:C)/SQRT(Data!B14)","v":{"$error":"#DIV/0!"}},{"$f":"IF(AND(Data!A14<>\"\",Chart!$O$2=\"Yes\"),Data!A14,\"\")","v":""}]
["",{"$f":"IF(Data!B15=\"\",\"\",Data!B15)","v":""},{"$f":"IF(Data!C15=\"\",\"\",Data!C15)","v":""},{"$f":"IF(B11=\"\",\"\",AVERAGE(Data!C:C))","v":""},{"$f":"IF(B11=\"\",\"\",IF((AVERAGE(Data!C:C)-2*J11)<0,0,AVERAGE(Data!C:C)-2*J11))","v":""},{"$f":"IF(B11=\"\",\"\",AVERAGE(Data!C:C)+2*J11)","v":""},{"$f":"IF(B11=\"\",\"\",IF(Data!C15<E11,Data!C15,#N/A))","v":""},{"$f":"IF(AND(Data!C15>=E11,Data!C15<=F11)=TRUE,Data!C15,#N/A)","v":0},{"$f":"IF(B11=\"\",\"\",IF(Data!C15>F11,Data!C15,#N/A))","v":""},{"$f":"STDEV(Data!C:C)/SQRT(Data!B15)","v":{"$error":"#DIV/0!"}},{"$f":"IF(AND(Data!A15<>\"\",Chart!$O$2=\"Yes\"),Data!A15,\"\")","v":""}]
["",{"$f":"IF(Data!B16=\"\",\"\",Data!B16)","v":""},{"$f":"IF(Data!C16=\"\",\"\",Data!C16)","v":""},{"$f":"IF(B12=\"\",\"\",AVERAGE(Data!C:C))","v":""},{"$f":"IF(B12=\"\",\"\",IF((AVERAGE(Data!C:C)-2*J12)<0,0,AVERAGE(Data!C:C)-2*J12))","v":""},{"$f":"IF(B12=\"\",\"\",AVERAGE(Data!C:C)+2*J12)","v":""},{"$f":"IF(B12=\"\",\"\",IF(Data!C16<E12,Data!C16,#N/A))","v":""},{"$f":"IF(AND(Data!C16>=E12,Data!C16<=F12)=TRUE,Data!C16,#N/A)","v":0},{"$f":"IF(B12=\"\",\"\",IF(Data!C16>F12,Data!C16,#N/A))","v":""},{"$f":"STDEV(Data!C:C)/SQRT(Data!B16)","v":{"$error":"#DIV/0!"}},{"$f":"IF(AND(Data!A16<>\"\",Chart!$O$2=\"Yes\"),Data!A16,\"\")","v":""}]
["",{"$f":"IF(Data!B17=\"\",\"\",Data!B17)","v":""},{"$f":"IF(Data!C17=\"\",\"\",Data!C17)","v":""},{"$f":"IF(B13=\"\",\"\",AVERAGE(Data!C:C))","v":""},{"$f":"IF(B13=\"\",\"\",IF((AVERAGE(Data!C:C)-2*J13)<0,0,AVERAGE(Data!C:C)-2*J13))","v":""},{"$f":"IF(B13=\"\",\"\",AVERAGE(Data!C:C)+2*J13)","v":""},{"$f":"IF(B13=\"\",\"\",IF(Data!C17<E13,Data!C17,#N/A))","v":""},{"$f":"IF(AND(Data!C17>=E13,Data!C17<=F13)=TRUE,Data!C17,#N/A)","v":0},{"$f":"IF(B13=\"\",\"\",IF(Data!C17>F13,Data!C17,#N/A))","v":""},{"$f":"STDEV(Data!C:C)/SQRT(Data!B17)","v":{"$error":"#DIV/0!"}},{"$f":"IF(AND(Data!A17<>\"\",Chart!$O$2=\"Yes\"),Data!A17,\"\")","v":""}]
["",{"$f":"IF(Data!B18=\"\",\"\",Data!B18)","v":""},{"$f":"IF(Data!C18=\"\",\"\",Data!C18)","v":""},{"$f":"IF(B14=\"\",\"\",AVERAGE(Data!C:C))","v":""},{"$f":"IF(B14=\"\",\"\",IF((AVERAGE(Data!C:C)-2*J14)<0,0,AVERAGE(Data!C:C)-2*J14))","v":""},{"$f":"IF(B14=\"\",\"\",AVERAGE(Data!C:C)+2*J14)","v":""},{"$f":"IF(B14=\"\",\"\",IF(Data!C18<E14,Data!C18,#N/A))","v":""},{"$f":"IF(AND(Data!C18>=E14,Data!C18<=F14)=TRUE,Data!C18,#N/A)","v":0},{"$f":"IF(B14=\"\",\"\",IF(Data!C18>F14,Data!C18,#N/A))","v":""},{"$f":"STDEV(Data!C:C)/SQRT(Data!B18)","v":{"$error":"#DIV/0!"}},{"$f":"IF(AND(Data!A18<>\"\",Chart!$O$2=\"Yes\"),Data!A18,\"\")","v":""}]
["",{"$f":"IF(Data!B19=\"\",\"\",Data!B19)","v":""},{"$f":"IF(Data!C19=\"\",\"\",Data!C19)","v":""},{"$f":"IF(B15=\"\",\"\",AVERAGE(Data!C:C))","v":""},{"$f":"IF(B15=\"\",\"\",IF((AVERAGE(Data!C:C)-2*J15)<0,0,AVERAGE(Data!C:C)-2*J15))","v":""},{"$f":"IF(B15=\"\",\"\",AVERAGE(Data!C:C)+2*J15)","v":""},{"$f":"IF(B15=\"\",\"\",IF(Data!C19<E15,Data!C19,#N/A))","v":""},{"$f":"IF(AND(Data!C19>=E15,Data!C19<=F15)=TRUE,Data!C19,#N/A)","v":0},{"$f":"IF(B15=\"\",\"\",IF(Data!C19>F15,Data!C19,#N/A))","v":""},{"$f":"STDEV(Data!C:C)/SQRT(Data!B19)","v":{"$error":"#DIV/0!"}},{"$f":"IF(AND(Data!A19<>\"\",Chart!$O$2=\"Yes\"),Data!A19,\"\")","v":""}]
["",{"$f":"IF(Data!B20=\"\",\"\",Data!B20)","v":""},{"$f":"IF(Data!C20=\"\",\"\",Data!C20)","v":""},{"$f":"IF(B16=\"\",\"\",AVERAGE(Data!C:C))","v":""},{"$f":"IF(B16=\"\",\"\",IF((AVERAGE(Data!C:C)-2*J16)<0,0,AVERAGE(Data!C:C)-2*J16))","v":""},{"$f":"IF(B16=\"\",\"\",AVERAGE(Data!C:C)+2*J16)","v":""},{"$f":"IF(B16=\"\",\"\",IF(Data!C20<E16,Data!C20,#N/A))","v":""},{"$f":"IF(AND(Data!C20>=E16,Data!C20<=F16)=TRUE,Data!C20,#N/A)","v":0},{"$f":"IF(B16=\"\",\"\",IF(Data!C20>F16,Data!C20,#N/A))","v":""},{"$f":"STDEV(Data!C:C)/SQRT(Data!B20)","v":{"$error":"#DIV/0!"}},{"$f":"IF(AND(Data!A20<>\"\",Chart!$O$2=\"Yes\"),Data!A20,\"\")","v":""}]
["",{"$f":"IF(Data!B21=\"\",\"\",Data!B21)","v":""},{"$f":"IF(Data!C21=\"\",\"\",Data!C21)","v":""},{"$f":"IF(B17=\"\",\"\",AVERAGE(Data!C:C))","v":""},{"$f":"IF(B17=\"\",\"\",IF((AVERAGE(Data!C:C)-2*J17)<0,0,AVERAGE(Data!C:C)-2*J17))","v":""},{"$f":"IF(B17=\"\",\"\",AVERAGE(Data!C:C)+2*J17)","v":""},{"$f":"IF(B17=\"\",\"\",IF(Data!C21<E17,Data!C21,#N/A))","v":""},{"$f":"IF(AND(Data!C21>=E17,Data!C21<=F17)=TRUE,Data!C21,#N/A)","v":0},{"$f":"IF(B17=\"\",\"\",IF(Data!C21>F17,Data!C21,#N/A))","v":""},{"$f":"STDEV(Data!C:C)/SQRT(Data!B21)","v":{"$error":"#DIV/0!"}},{"$f":"IF(AND(Data!A21<>\"\",Chart!$O$2=\"Yes\"),Data!A21,\"\")","v":""}]
["",{"$f":"IF(Data!B22=\"\",\"\",Data!B22)","v":""},{"$f":"IF(Data!C22=\"\",\"\",Data!C22)","v":""},{"$f":"IF(B18=\"\",\"\",AVERAGE(Data!C:C))","v":""},{"$f":"IF(B18=\"\",\"\",IF((AVERAGE(Data!C:C)-2*J18)<0,0,AVERAGE(Data!C:C)-2*J18))","v":""},{"$f":"IF(B18=\"\",\"\",AVERAGE(Data!C:C)+2*J18)","v":""},{"$f":"IF(B18=\"\",\"\",IF(Data!C22<E18,Data!C22,#N/A))","v":""},{"$f":"IF(AND(Data!C22>=E18,Data!C22<=F18)=TRUE,Data!C22,#N/A)","v":0},{"$f":"IF(B18=\"\",\"\",IF(Data!C22>F18,Data!C22,#N/A))","v":""},{"$f":"STDEV(Data!C:C)/SQRT(Data!B22)","v":{"$error":"#DIV/0!"}},{"$f":"IF(AND(Data!A22<>\"\",Chart!$O$2=\"Yes\"),Data!A22,\"\")","v":""}]
["",{"$f":"IF(Data!B23=\"\",\"\",Data!B23)","v":""},{"$f":"IF(Data!C23=\"\",\"\",Data!C23)","v":""},{"$f":"IF(B19=\"\",\"\",AVERAGE(Data!C:C))","v":""},{"$f":"IF(B19=\"\",\"\",IF((AVERAGE(Data!C:C)-2*J19)<0,0,AVERAGE(Data!C:C)-2*J19))","v":""},{"$f":"IF(B19=\"\",\"\",AVERAGE(Data!C:C)+2*J19)","v":""},{"$f":"IF(B19=\"\",\"\",IF(Data!C23<E19,Data!C23,#N/A))","v":""},{"$f":"IF(AND(Data!C23>=E19,Data!C23<=F19)=TRUE,Data!C23,#N/A)","v":0},{"$f":"IF(B19=\"\",\"\",IF(Data!C23>F19,Data!C23,#N/A))","v":""},{"$f":"STDEV(Data!C:C)/SQRT(Data!B23)","v":{"$error":"#DIV/0!"}},{"$f":"IF(AND(Data!A23<>\"\",Chart!$O$2=\"Yes\"),Data!A23,\"\")","v":""}]
["",{"$f":"IF(Data!B24=\"\",\"\",Data!B24)","v":""},{"$f":"IF(Data!C24=\"\",\"\",Data!C24)","v":""},{"$f":"IF(B20=\"\",\"\",AVERAGE(Data!C:C))","v":""},{"$f":"IF(B20=\"\",\"\",IF((AVERAGE(Data!C:C)-2*J20)<0,0,AVERAGE(Data!C:C)-2*J20))","v":""},{"$f":"IF(B20=\"\",\"\",AVERAGE(Data!C:C)+2*J20)","v":""},{"$f":"IF(B20=\"\",\"\",IF(Data!C24<E20,Data!C24,#N/A))","v":""},{"$f":"IF(AND(Data!C24>=E20,Data!C24<=F20)=TRUE,Data!C24,#N/A)","v":0},{"$f":"IF(B20=\"\",\"\",IF(Data!C24>F20,Data!C24,#N/A))","v":""},{"$f":"STDEV(Data!C:C)/SQRT(Data!B24)","v":{"$error":"#DIV/0!"}},{"$f":"IF(AND(Data!A24<>\"\",Chart!$O$2=\"Yes\"),Data!A24,\"\")","v":""}]
["",{"$f":"IF(Data!B25=\"\",\"\",Data!B25)","v":""},{"$f":"IF(Data!C25=\"\",\"\",Data!C25)","v":""},{"$f":"IF(B21=\"\",\"\",AVERAGE(Data!C:C))","v":""},{"$f":"IF(B21=\"\",\"\",IF((AVERAGE(Data!C:C)-2*J21)<0,0,AVERAGE(Data!C:C)-2*J21))","v":""},{"$f":"IF(B21=\"\",\"\",AVERAGE(Data!C:C)+2*J21)","v":""},{"$f":"IF(B21=\"\",\"\",IF(Data!C25<E21,Data!C25,#N/A))","v":""},{"$f":"IF(AND(Data!C25>=E21,Data!C25<=F21)=TRUE,Data!C25,#N/A)","v":0},{"$f":"IF(B21=\"\",\"\",IF(Data!C25>F21,Data!C25,#N/A))","v":""},{"$f":"STDEV(Data!C:C)/SQRT(Data!B25)","v":{"$error":"#DIV/0!"}},{"$f":"IF(AND(Data!A25<>\"\",Chart!$O$2=\"Yes\"),Data!A25,\"\")","v":""}]
["",{"$f":"IF(Data!B26=\"\",\"\",Data!B26)","v":""},{"$f":"IF(Data!C26=\"\",\"\",Data!C26)","v":""},{"$f":"IF(B22=\"\",\"\",AVERAGE(Data!C:C))","v":""},{"$f":"IF(B22=\"\",\"\",IF((AVERAGE(Data!C:C)-2*J22)<0,0,AVERAGE(Data!C:C)-2*J22))","v":""},{"$f":"IF(B22=\"\",\"\",AVERAGE(Data!C:C)+2*J22)","v":""},{"$f":"IF(B22=\"\",\"\",IF(Data!C26<E22,Data!C26,#N/A))","v":""},{"$f":"IF(AND(Data!C26>=E22,Data!C26<=F22)=TRUE,Data!C26,#N/A)","v":0},{"$f":"IF(B22=\"\",\"\",IF(Data!C26>F22,Data!C26,#N/A))","v":""},{"$f":"STDEV(Data!C:C)/SQRT(Data!B26)","v":{"$error":"#DIV/0!"}},{"$f":"IF(AND(Data!A26<>\"\",Chart!$O$2=\"Yes\"),Data!A26,\"\")","v":""}]
["",{"$f":"IF(Data!B27=\"\",\"\",Data!B27)","v":""},{"$f":"IF(Data!C27=\"\",\"\",Data!C27)","v":""},{"$f":"IF(B23=\"\",\"\",AVERAGE(Data!C:C))","v":""},{"$f":"IF(B23=\"\",\"\",IF((AVERAGE(Data!C:C)-2*J23)<0,0,AVERAGE(Data!C:C)-2*J23))","v":""},{"$f":"IF(B23=\"\",\"\",AVERAGE(Data!C:C)+2*J23)","v":""},{"$f":"IF(B23=\"\",\"\",IF(Data!C27<E23,Data!C27,#N/A))","v":""},{"$f":"IF(AND(Data!C27>=E23,Data!C27<=F23)=TRUE,Data!C27,#N/A)","v":0},{"$f":"IF(B23=\"\",\"\",IF(Data!C27>F23,Data!C27,#N/A))","v":""},{"$f":"STDEV(Data!C:C)/SQRT(Data!B27)","v":{"$error":"#DIV/0!"}},{"$f":"IF(AND(Data!A27<>\"\",Chart!$O$2=\"Yes\"),Data!A27,\"\")","v":""}]
["",{"$f":"IF(Data!B28=\"\",\"\",Data!B28)","v":""},{"$f":"IF(Data!C28=\"\",\"\",Data!C28)","v":""},{"$f":"IF(B24=\"\",\"\",AVERAGE(Data!C:C))","v":""},{"$f":"IF(B24=\"\",\"\",IF((AVERAGE(Data!C:C)-2*J24)<0,0,AVERAGE(Data!C:C)-2*J24))","v":""},{"$f":"IF(B24=\"\",\"\",AVERAGE(Data!C:C)+2*J24)","v":""},{"$f":"IF(B24=\"\",\"\",IF(Data!C28<E24,Data!C28,#N/A))","v":""},{"$f":"IF(AND(Data!C28>=E24,Data!C28<=F24)=TRUE,Data!C28,#N/A)","v":0},{"$f":"IF(B24=\"\",\"\",IF(Data!C28>F24,Data!C28,#N/A))","v":""},{"$f":"STDEV(Data!C:C)/SQRT(Data!B28)","v":{"$error":"#DIV/0!"}},{"$f":"IF(AND(Data!A28<>\"\",Chart!$O$2=\"Yes\"),Data!A28,\"\")","v":""}]
["",{"$f":"IF(Data!B29=\"\",\"\",Data!B29)","v":""},{"$f":"IF(Data!C29=\"\",\"\",Data!C29)","v":""},{"$f":"IF(B25=\"\",\"\",AVERAGE(Data!C:C))","v":""},{"$f":"IF(B25=\"\",\"\",IF((AVERAGE(Data!C:C)-2*J25)<0,0,AVERAGE(Data!C:C)-2*J25))","v":""},{"$f":"IF(B25=\"\",\"\",AVERAGE(Data!C:C)+2*J25)","v":""},{"$f":"IF(B25=\"\",\"\",IF(Data!C29<E25,Data!C29,#N/A))","v":""},{"$f":"IF(AND(Data!C29>=E25,Data!C29<=F25)=TRUE,Data!C29,#N/A)","v":0},{"$f":"IF(B25=\"\",\"\",IF(Data!C29>F25,Data!C29,#N/A))","v":""},{"$f":"STDEV(Data!C:C)/SQRT(Data!B29)","v":{"$error":"#DIV/0!"}},{"$f":"IF(AND(Data!A29<>\"\",Chart!$O$2=\"Yes\"),Data!A29,\"\")","v":""}]
["",{"$f":"IF(Data!B30=\"\",\"\",Data!B30)","v":""},{"$f":"IF(Data!C30=\"\",\"\",Data!C30)","v":""},{"$f":"IF(B26=\"\",\"\",AVERAGE(Data!C:C))","v":""},{"$f":"IF(B26=\"\",\"\",IF((AVERAGE(Data!C:C)-2*J26)<0,0,AVERAGE(Data!C:C)-2*J26))","v":""},{"$f":"IF(B26=\"\",\"\",AVERAGE(Data!C:C)+2*J26)","v":""},{"$f":"IF(B26=\"\",\"\",IF(Data!C30<E26,Data!C30,#N/A))","v":""},{"$f":"IF(AND(Data!C30>=E26,Data!C30<=F26)=TRUE,Data!C30,#N/A)","v":0},{"$f":"IF(B26=\"\",\"\",IF(Data!C30>F26,Data!C30,#N/A))","v":""},{"$f":"STDEV(Data!C:C)/SQRT(Data!B30)","v":{"$error":"#DIV/0!"}},{"$f":"IF(AND(Data!A30<>\"\",Chart!$O$2=\"Yes\"),Data!A30,\"\")","v":""}]
["",{"$f":"IF(Data!B31=\"\",\"\",Data!B31)","v":""},{"$f":"IF(Data!C31=\"\",\"\",Data!C31)","v":""},{"$f":"IF(B27=\"\",\"\",AVERAGE(Data!C:C))","v":""},{"$f":"IF(B27=\"\",\"\",IF((AVERAGE(Data!C:C)-2*J27)<0,0,AVERAGE(Data!C:C)-2*J27))","v":""},{"$f":"IF(B27=\"\",\"\",AVERAGE(Data!C:C)+2*J27)","v":""},{"$f":"IF(B27=\"\",\"\",IF(Data!C31<E27,Data!C31,#N/A))","v":""},{"$f":"IF(AND(Data!C31>=E27,Data!C31<=F27)=TRUE,Data!C31,#N/A)","v":0},{"$f":"IF(B27=\"\",\"\",IF(Data!C31>F27,Data!C31,#N/A))","v":""},{"$f":"STDEV(Data!C:C)/SQRT(Data!B31)","v":{"$error":"#DIV/0!"}},{"$f":"IF(AND(Data!A31<>\"\",Chart!$O$2=\"Yes\"),Data!A31,\"\")","v":""}]
["",{"$f":"IF(Data!B32=\"\",\"\",Data!B32)","v":""},{"$f":"IF(Data!C32=\"\",\"\",Data!C32)","v":""},{"$f":"IF(B28=\"\",\"\",AVERAGE(Data!C:C))","v":""},{"$f":"IF(B28=\"\",\"\",IF((AVERAGE(Data!C:C)-2*J28)<0,0,AVERAGE(Data!C:C)-2*J28))","v":""},{"$f":"IF(B28=\"\",\"\",AVERAGE(Data!C:C)+2*J28)","v":""},{"$f":"IF(B28=\"\",\"\",IF(Data!C32<E28,Data!C32,#N/A))","v":""},{"$f":"IF(AND(Data!C32>=E28,Data!C32<=F28)=TRUE,Data!C32,#N/A)","v":0},{"$f":"IF(B28=\"\",\"\",IF(Data!C32>F28,Data!C32,#N/A))","v":""},{"$f":"STDEV(Data!C:C)/SQRT(Data!B32)","v":{"$error":"#DIV/0!"}},{"$f":"IF(AND(Data!A32<>\"\",Chart!$O$2=\"Yes\"),Data!A32,\"\")","v":""}]
["",{"$f":"IF(Data!B33=\"\",\"\",Data!B33)","v":""},{"$f":"IF(Data!C33=\"\",\"\",Data!C33)","v":""},{"$f":"IF(B29=\"\",\"\",AVERAGE(Data!C:C))","v":""},{"$f":"IF(B29=\"\",\"\",IF((AVERAGE(Data!C:C)-2*J29)<0,0,AVERAGE(Data!C:C)-2*J29))","v":""},{"$f":"IF(B29=\"\",\"\",AVERAGE(Data!C:C)+2*J29)","v":""},{"$f":"IF(B29=\"\",\"\",IF(Data!C33<E29,Data!C33,#N/A))","v":""},{"$f":"IF(AND(Data!C33>=E29,Data!C33<=F29)=TRUE,Data!C33,#N/A)","v":0},{"$f":"IF(B29=\"\",\"\",IF(Data!C33>F29,Data!C33,#N/A))","v":""},{"$f":"STDEV(Data!C:C)/SQRT(Data!B33)","v":{"$error":"#DIV/0!"}},{"$f":"IF(AND(Data!A33<>\"\",Chart!$O$2=\"Yes\"),Data!A33,\"\")","v":""}]
["",{"$f":"IF(Data!B34=\"\",\"\",Data!B34)","v":""},{"$f":"IF(Data!C34=\"\",\"\",Data!C34)","v":""},{"$f":"IF(B30=\"\",\"\",AVERAGE(Data!C:C))","v":""},{"$f":"IF(B30=\"\",\"\",IF((AVERAGE(Data!C:C)-2*J30)<0,0,AVERAGE(Data!C:C)-2*J30))","v":""},{"$f":"IF(B30=\"\",\"\",AVERAGE(Data!C:C)+2*J30)","v":""},{"$f":"IF(B30=\"\",\"\",IF(Data!C34<E30,Data!C34,#N/A))","v":""},{"$f":"IF(AND(Data!C34>=E30,Data!C34<=F30)=TRUE,Data!C34,#N/A)","v":0},{"$f":"IF(B30=\"\",\"\",IF(Data!C34>F30,Data!C34,#N/A))","v":""},{"$f":"STDEV(Data!C:C)/SQRT(Data!B34)","v":{"$error":"#DIV/0!"}},{"$f":"IF(AND(Data!A34<>\"\",Chart!$O$2=\"Yes\"),Data!A34,\"\")","v":""}]
{"$rows_left_out":175}